หน้าแรก
คอมมูนิตี้
ห้อง
แท็ก
คลับ
ห้อง
แก้ไขปักหมุด
ดูทั้งหมด
เกิดข้อผิดพลาดบางอย่าง
ลองใหม่
แท็ก
แก้ไขปักหมุด
ดูเพิ่มเติม
เกิดข้อผิดพลาดบางอย่าง
ลองใหม่
{room_name}
{name}
{description}
กิจกรรม
แลกพอยต์
อื่นๆ
ตั้งกระทู้
เข้าสู่ระบบ / สมัครสมาชิก
เว็บไซต์ในเครือ
Bloggang
Pantown
PantipMarket
Maggang
ติดตามพันทิป
ดาวน์โหลดได้แล้ววันนี้
เกี่ยวกับเรา
กฎ กติกา และมารยาท
คำแนะนำการโพสต์แสดงความเห็น
นโยบายเกี่ยวกับข้อมูลส่วนบุคคล
สิทธิ์การใช้งานของสมาชิก
ติดต่อทีมงาน Pantip
ติดต่อลงโฆษณา
ร่วมงานกับ Pantip
Download App Pantip
Pantip Certified Developer
ทำไมคอมไพแล้วมันขึ้นแบบนี้ครับ
กระทู้คำถาม
การพัฒนาซอฟต์แวร์
exit status 1
Error compiling for board Arduino/Genuino Uno.
แก้ไขข้อความเมื่อ
▼
กำลังโหลดข้อมูล...
▼
แสดงความคิดเห็น
กระทู้ที่คุณอาจสนใจ
อาดูโน่ Error คับ
exit status 1 Error compiling for board Arduino/Genuino Uno. มันคืออะไรครับ ผมกำลังศึกษาช่วยผมหน่อย
สมาชิกหมายเลข 2154226
ARDUINO ขึ้นข้อผิดพลาดแบบนี้ทำไงครับ
Arduino: 1.6.10 (Windows 10), Board: "Arduino/Genuino Uno" C:\Users\USER\AppData\Local\Temp\Rar$DIa0.883\toneMelody\toneMelody.ino:18:22: fatal error: pitches.h: No such file or directory
สมาชิกหมายเลข 2472300
Arduino มันขึ้น Copy Error Messages คับ
มันขึ้นยังงี้อ่าคับ C:\Users\user\Documents\Arduino\libraries\sketch_sep12a\sketch_sep12a.ino:4:22: fatal error: TimerOne.h: No such file or directory #include <TimerOne.h> ^ compilation t
สมาชิกหมายเลข 4092387
เจอแบบนี้ทำยังไงครับ?(Arduino)
มันขึ้นว่า open NUL: The system cannot find the file specified. Error compiling for board Arduino/Genuino Uno. จะต้องแก่ยังไงครับ?
สมาชิกหมายเลข 6242021
arduino ขึ้นแบบนี้แก้ยังไงครับ
In file included from c:\Users\Windows 10\Documents\Arduino\libraries\Blynk\src/Blynk.h:14,  
สมาชิกหมายเลข 7671016
ช่วยด้วยครับผมต้องส่งงานไม้กั้นรถ ขึ้นแบบนี้หมายความวา่าไงครับ (Arduino Uno)
Sketch uses 2194 bytes (6%) of program storage space. Maximum is 32256 bytes. Global variables use 50 bytes (2%)&nb
สมาชิกหมายเลข 8378240
เขียน arduino
Compilation error: Error: 2 UNKNOWN: exit status 1 มันขึ้นแบบนี้มันหมายความว่าไงหรอครับ ?
สมาชิกหมายเลข 3049117
arduiano ขึ้นแบบนี้แก้ไงครับ
avrdude: ser_open(): can't open device "\\.\COM3": The system cannot find the file specified. Failed uploading: uploading error:
สมาชิกหมายเลข 7959667
Ubuntu server
พอดีผมจะติดตั้ง freeradius แล้วผมไปทำอะไรมันไม่รู้ เวลาผมติดตั้งอะไร มันจะขึ้นโต้ด Error ประมาณว่า dpkg : error processing package freeradius (--configure) : Installed freeradius package post-in
สมาชิกหมายเลข 5900109
ARDUINO R3 ลงlibrary wifi esp8266ไม่ได้
#include <ESP8266WiFi.h> ^~~~~~~~~~~~~~~ compilation terminated. exit status 1 ESP8266WiFi.h: No such file or d
สมาชิกหมายเลข 5071084
อ่านกระทู้อื่นที่พูดคุยเกี่ยวกับ
การพัฒนาซอฟต์แวร์
บนสุด
ล่างสุด
อ่านเฉพาะข้อความเจ้าของกระทู้
หน้า:
หน้า
จาก
แชร์ :
โปรดศึกษาและยอมรับนโยบายข้อมูลส่วนบุคคลก่อนเริ่มใช้งาน
อ่านเพิ่มเติมได้ที่นี่
ยอมรับ
ทำไมคอมไพแล้วมันขึ้นแบบนี้ครับ
Error compiling for board Arduino/Genuino Uno.